Reaction Details
TargetAcetylcholinesterase
LigandBDBM50389379
Substrate/Competitorn/a
Meas. Tech.ChEMBL_831935 (CHEMBL2066009)
Ki 80±n/a nM
Citation Hamulakova, SJanovec, LHrabinova, MKristian, PKuca, KBanasova, MImrich, J Synthesis, design and biological evaluation of novel highly potent tacrine congeners for the treatment of Alzheimer's disease. Eur J Med Chem55:23-31 (2012) 
 
Acetylcholinesterase
Name:Acetylcholinesterase
Type:Enzyme
Mol. Mass.:67792.70
Organism:Homo sapiens (Human)
Description:P22303
Residue:614
BDBM50389379
NameBDBM50389379
Synonyms:CHEMBL2064470
TypeSmall organic molecule
Emp. Form.C29H39N5
Mol. Mass.457.6535
SMILESCN(CCCN1CCN(CCNc2c3CCCCc3nc3ccccc23)CC1)c1ccccc1