Reaction Details
TargetDipeptidyl peptidase 8
LigandBDBM50389467
Substrate/Competitorn/a
Meas. Tech.ChEMBL_832306 (CHEMBL2066844)
IC50 23±n/a nM
Citation Wu, WLiu, YMilo, LJShu, YZhao, PLi, YWoznica, IYu, GSanford, DGZhou, YPoplawski, SEConnolly, BASudmeier, JLBachovchin, WWLai, JH 4-Substituted boro-proline dipeptides: synthesis, characterization, and dipeptidyl peptidase IV, 8, and 9 activities. Bioorg Med Chem Lett22:5536-40 (2012) 
 
Dipeptidyl peptidase 8
Name:Dipeptidyl peptidase 8
Type:Enzyme
Mol. Mass.:103342.62
Organism:Homo sapiens (Human)
Description:Q6V1X1
Residue:898
BDBM50389467
NameBDBM50389467
Synonyms:CHEMBL2063026
TypeSmall organic molecule
Emp. Form.C7H14BFN2O3
Mol. Mass.204.007
SMILESC[C@H](N)C(=O)N1C[C@H](F)C[C@H]1B(O)O