Reaction Details
TargetDipeptidyl peptidase 9
LigandBDBM50389471
Substrate/Competitorn/a
Meas. Tech.ChEMBL_832307 (CHEMBL2066845)
IC50 6.4±n/a nM
Citation Wu, WLiu, YMilo, LJShu, YZhao, PLi, YWoznica, IYu, GSanford, DGZhou, YPoplawski, SEConnolly, BASudmeier, JLBachovchin, WWLai, JH 4-Substituted boro-proline dipeptides: synthesis, characterization, and dipeptidyl peptidase IV, 8, and 9 activities. Bioorg Med Chem Lett22:5536-40 (2012) 
 
Dipeptidyl peptidase 9
Name:Dipeptidyl peptidase 9
Type:Enzyme
Mol. Mass.:98260.70
Organism:Homo sapiens (Human)
Description:Q86TI2
Residue:863
BDBM50389471
NameBDBM50389471
Synonyms:CHEMBL2063031
TypeSmall organic molecule
Emp. Form.C10H21BN2O4
Mol. Mass.244.096
SMILESCC(C)(C)[C@H](N)C(=O)N1C[C@@H](O)C[C@H]1B(O)O