Reaction Details
TargetOrphan methyltransferase M.SssI
LigandBDBM50389499
Substrate/Competitorn/a
Meas. Tech.ChEMBL_832312 (CHEMBL2066850)
Ki 250000±n/a nM
Citation Plitta, BAdamska, EGiel-Pietraszuk, MFedoruk-Wyszomirska, ANaskret-Barciszewska, MMarkiewicz, WTBarciszewski, J New cytosine derivatives as inhibitors of DNA methylation. Eur J Med Chem55:243-54 (2012) 
 
Orphan methyltransferase M.SssI
Name:Orphan methyltransferase M.SssI
Type:Protein
Mol. Mass.:44323.75
Organism:Spiroplasma monobiae strain MQ-1
Description:P15840
Residue:386
BDBM50389499
NameBDBM50389499
Synonyms:CHEMBL2063049
TypeSmall organic molecule
Emp. Form.C15H19N3O5
Mol. Mass.321.3285
SMILESCc1cn([C@H]2C[C@H](O)[C@@H](CO)O2)c(=O)nc1NCc1ccco1