Reaction Details
TargetOrphan methyltransferase M.SssI
LigandBDBM50389500
Substrate/Competitorn/a
Meas. Tech.ChEMBL_832312 (CHEMBL2066850)
Ki 960000±n/a nM
Citation Plitta, BAdamska, EGiel-Pietraszuk, MFedoruk-Wyszomirska, ANaskret-Barciszewska, MMarkiewicz, WTBarciszewski, J New cytosine derivatives as inhibitors of DNA methylation. Eur J Med Chem55:243-54 (2012) 
 
Orphan methyltransferase M.SssI
Name:Orphan methyltransferase M.SssI
Type:Protein
Mol. Mass.:44323.75
Organism:Spiroplasma monobiae strain MQ-1
Description:P15840
Residue:386
BDBM50389500
NameBDBM50389500
Synonyms:CHEMBL2063047
TypeSmall organic molecule
Emp. Form.C14H20N4O2
Mol. Mass.276.3342
SMILESCCCCNCc1cnc(=O)[nH]c1NCc1ccco1