Reaction Details
TargetCorticotropin-releasing factor receptor 1
LigandBDBM50389530
Substrate/Competitorn/a
Meas. Tech.ChEMBL_832416 (CHEMBL2067140)
IC50 24±n/a nM
Citation Takeda, KTerauchi, THashizume, MShin, KIno, MShibata, HYonaga, M Design, synthesis, and structure-activity relationships of a series of 2-Ar-8-methyl-5-alkylaminoquinolines as novel CRF1 receptor antagonists. Bioorg Med Chem Lett22:5372-8 (2012) 
 
Corticotropin-releasing factor receptor 1
Name:Corticotropin-releasing factor receptor 1
Type:Enzyme
Mol. Mass.:50744.31
Organism:Homo sapiens (Human)
Description:P34998
Residue:444
BDBM50389530
NameBDBM50389530
Synonyms:CHEMBL2063372
TypeSmall organic molecule
Emp. Form.C25H32N2O3
Mol. Mass.408.5332
SMILESCCN(CC)c1ccc(C)c2nc(c(C)cc12)-c1c(OC)cc(COC)cc1OC