Reaction Details
TargetPotassium voltage-gated channel subfamily H member 2
LigandBDBM50389592
Substrate/Competitorn/a
Meas. Tech.ChEMBL_833911 (CHEMBL2072491)
IC50 77±n/a nM
Citation Pasternak, AFeng, Zde Jesus, RYe, ZHe, SDobbelaar, PBradley, SAChicchi, GGTsao, KLTrusca, DEiermann, GJLi, CFeng, YWu, MShao, QZhang, BBNargund, RMills, SGHoward, ADYang, LZhou, YP Stimulation of Glucose-Dependent Insulin Secretion by a Potent, Selective sst3 Antagonist. ACS Med Chem Lett3:289-293 (2012) 
 
Potassium voltage-gated channel subfamily H member 2
Name:Potassium voltage-gated channel subfamily H member 2
Type:Multi-pass membrane protein
Mol. Mass.:126672.65
Organism:Homo sapiens (Human)
Description:Q12809
Residue:1159
BDBM50389592
NameBDBM50389592
Synonyms:CHEMBL2069500
TypeSmall organic molecule
Emp. Form.C26H28N4
Mol. Mass.396.5273
SMILESC1CCC(CC1)C1N[C@H](Cc2c1[nH]c1ccccc21)c1nc(c[nH]1)-c1ccccc1