Reaction Details
TargetSomatostatin receptor type 3
LigandBDBM50389603
Substrate/Competitorn/a
Meas. Tech.ChEMBL_833909 (CHEMBL2072489)
Ki 0.640000±n/a nM
Citation Pasternak, AFeng, Zde Jesus, RYe, ZHe, SDobbelaar, PBradley, SAChicchi, GGTsao, KLTrusca, DEiermann, GJLi, CFeng, YWu, MShao, QZhang, BBNargund, RMills, SGHoward, ADYang, LZhou, YP Stimulation of Glucose-Dependent Insulin Secretion by a Potent, Selective sst3 Antagonist. ACS Med Chem Lett3:289-293 (2012) 
 
Somatostatin receptor type 3
Name:Somatostatin receptor type 3
Type:Protein
Mol. Mass.:45855.97
Organism:Homo sapiens (Human)
Description:P32745
Residue:418
BDBM50389603
NameBDBM50389603
Synonyms:CHEMBL2069499
TypeSmall organic molecule
Emp. Form.C28H34N4
Mol. Mass.426.5964
SMILESCCCCC1(CCCC)N[C@H](Cc2c1[nH]c1ccccc21)c1nc(c[nH]1)-c1ccccc1