Reaction Details
TargetVascular endothelial growth factor receptor 2
LigandBDBM50389606
Substrate/Competitorn/a
Meas. Tech.ChEMBL_834046 (CHEMBL2072786)
Ki 25000±n/a nM
Citation Iwata, HOki, HOkada, KTakagi, TTawada, MMiyazaki, YImamura, SHori, ALawson, JDHixon, MSKimura, HMiki, H A Back-to-Front Fragment-Based Drug Design Search Strategy Targeting the DFG-Out Pocket of Protein Tyrosine Kinases. ACS Med Chem Lett3:342-346 (2012) 
 
Vascular endothelial growth factor receptor 2
Name:Vascular endothelial growth factor receptor 2
Type:Receptor Tyrosine Kinase
Mol. Mass.:151510.97
Organism:Homo sapiens (Human)
Description:P35968
Residue:1356
BDBM50389606
NameBDBM50389606
Synonyms:CHEMBL2069625
TypeSmall organic molecule
Emp. Form.C18H17NO3
Mol. Mass.295.3325
SMILESCc1oc(nc1COc1cccc(CO)c1)-c1ccccc1