Reaction Details
TargetPeroxisome proliferator-activated receptor gamma
LigandBDBM50240347
Substrate/Competitorn/a
Meas. Tech.ChEMBL_834189 (CHEMBL2072929)
Kd 2000±n/a nM
Citation Pirat, CFarce, ALebègue, NRenault, NFurman, CMillet, RYous, SSpeca, SBerthelot, PDesreumaux, PChavatte, P Targeting peroxisome proliferator-activated receptors (PPARs): development of modulators. J Med Chem55:4027-61 (2012) 
 
Peroxisome proliferator-activated receptor gamma
Name:Peroxisome proliferator-activated receptor gamma
Type:Nuclear Receptor
Mol. Mass.:57613.46
Organism:Homo sapiens (Human)
Description:P37231
Residue:505
BDBM50240347
NameBDBM50240347
Synonyms:(9,12,15)-linolenic acid (Z,Z,Z)-9,12,15-octadecatrienoic acid ALA all-cis-9,12,15-octadecatrienoic acid cid_5280934 cis-Delta(9,12,15)-octadecatrienoic acid | linolenic acid
TypeSmall organic molecule
Emp. Form.C18H30O2
Mol. Mass.278.4296
SMILESCC\C=C/C\C=C/C\C=C/CCCCCCCC(O)=O