Reaction Details
TargetEphrin type-A receptor 3
LigandBDBM50345739
Substrate/Competitorn/a
Meas. Tech.ChEMBL_834207 (CHEMBL2072947)
IC50 1600±n/a nM
Citation Johnson, SMMurphy, RCGeiger, JADeRocher, AEZhang, ZOjo, KKLarson, ETPerera, BGDale, EJHe, PReid, MCFox, AMMueller, NRMerritt, EAFan, EParsons, MVan Voorhis, WCMaly, DJ Development of Toxoplasma gondii calcium-dependent protein kinase 1 (TgCDPK1) inhibitors with potent anti-toxoplasma activity. J Med Chem55:2416-26 (2012) 
 
Ephrin type-A receptor 3
Name:Ephrin type-A receptor 3
Type:Protein
Mol. Mass.:110131.95
Organism:Homo sapiens (Human)
Description:P29320
Residue:983
BDBM50345739
NameBDBM50345739
Synonyms:1-isopropyl-3-(6-methoxynaphthalen-2-yl)-1H-pyrazolo[3,4-d]pyrimidin-4-amine CHEMBL2070045 US11247972, Compound 7q | US9765037, Compound 7q
TypeSmall organic molecule
Emp. Form.C19H19N5O
Mol. Mass.333.3871
SMILESCOc1ccc2cc(ccc2c1)-c1nn(C(C)C)c2ncnc(N)c12