Reaction Details
TargetTyrosine-protein kinase CSK
LigandBDBM50345740
Substrate/Competitorn/a
Meas. Tech.ChEMBL_834208 (CHEMBL2072948)
IC50 3100±n/a nM
Citation Johnson, SMMurphy, RCGeiger, JADeRocher, AEZhang, ZOjo, KKLarson, ETPerera, BGDale, EJHe, PReid, MCFox, AMMueller, NRMerritt, EAFan, EParsons, MVan Voorhis, WCMaly, DJ Development of Toxoplasma gondii calcium-dependent protein kinase 1 (TgCDPK1) inhibitors with potent anti-toxoplasma activity. J Med Chem55:2416-26 (2012) 
 
Tyrosine-protein kinase CSK
Name:Tyrosine-protein kinase CSK
Type:Tyrosine-protein kinase
Mol. Mass.:50707.30
Organism:Homo sapiens (Human)
Description:P41240
Residue:450
BDBM50345740
NameBDBM50345740
Synonyms:3-(6-ethoxynaphthalen-2-yl)-1-isopropyl-1H-pyrazolo[3,4-d]pyrimidin-4-amine CHEMBL2070048 US11247972, Compound 7r | US9765037, Compound 7r
TypeSmall organic molecule
Emp. Form.C20H21N5O
Mol. Mass.347.4136
SMILESCCOc1ccc2cc(ccc2c1)-c1nn(C(C)C)c2ncnc(N)c12