Reaction Details
TargetMelanocortin receptor 4
LigandBDBM50389769
Substrate/Competitorn/a
Meas. Tech.ChEMBL_834300 (CHEMBL2073120)
Ki 0.250000±n/a nM
Citation Conde-Frieboes, KThøgersen, HLau, JFSensfuss, UHansen, TKChristensen, LSpetzler, JOlsen, HBNilsson, CRaun, KDahl, KHansen, BSWulff, BS Identification and in vivo and in vitro characterization of long acting and melanocortin 4 receptor (MC4-R) selectivea-melanocyte-stimulating hormone (a-MSH) analogues. J Med Chem55:1969-77 (2012) 
 
Melanocortin receptor 4
Name:Melanocortin receptor 4
Type:Enzyme
Mol. Mass.:36949.50
Organism:Homo sapiens (Human)
Description:P32245
Residue:332
BDBM50389769
NameBDBM50389769
Synonyms:BREMELANOTIDE
TypeSmall organic molecule
Emp. Form.C50H68N14O10
Mol. Mass.1025.1627
SMILESCCCC[C@H](NC(C)=O)C(=O)N[C@H]1CC(=O)NCCCC[C@H](NC(=O)[C@H](Cc2c[nH]c3ccccc23)NC(=O)[C@H](CCCN=C(N)N)NC(=O)[C@@H](Cc2ccccc2)NC(=O)[C@H](Cc2cnc[nH]2)NC1=O)C(O)=O