Reaction Details
TargetMelanocortin receptor 5
LigandBDBM50389771
Substrate/Competitorn/a
Meas. Tech.ChEMBL_834299 (CHEMBL2073119)
Ki 1.6±n/a nM
Citation Conde-Frieboes, KThøgersen, HLau, JFSensfuss, UHansen, TKChristensen, LSpetzler, JOlsen, HBNilsson, CRaun, KDahl, KHansen, BSWulff, BS Identification and in vivo and in vitro characterization of long acting and melanocortin 4 receptor (MC4-R) selectivea-melanocyte-stimulating hormone (a-MSH) analogues. J Med Chem55:1969-77 (2012) 
 
Melanocortin receptor 5
Name:Melanocortin receptor 5
Type:Enzyme
Mol. Mass.:36612.92
Organism:Homo sapiens (Human)
Description:P33032
Residue:325
BDBM50389771
NameBDBM50389771
Synonyms:CHEMBL2070243
TypeSmall organic molecule
Emp. Form.C83H127N21O18
Mol. Mass.1707.0264
(=O)NCC(=O)N[C@@H](CO)C(=O)N[C@@H](CCC(N)=O)C(=O)N[C@@H](Cc1cnc[nH]1)C(=O)N[C@@H](CO)C(=O)N[C@@H](CCCC)C(=O)N[C@H]1CCC(=O)NCCCC[C@H](NC(=O)[C@H](Cc2c[nH]c3ccccc23)NC(=O)[C@H](CCCN=C(N)N)NC(=O)[C@@H](Cc2ccccc2)NC(=O)[C@@H]2C[C@@H](O)CN2C1=O)C(N)=O