Reaction Details
TargetAdenosine receptor A1
LigandBDBM21220
Substrate/Competitorn/a
Meas. Tech.ChEMBL_834569 (CHEMBL2072277)
Ki 63±n/a nM
Citation Tosh, DKPhan, KGao, ZGGakh, AAXu, FDeflorian, FAbagyan, RStevens, RCJacobson, KAKatritch, V Optimization of adenosine 5'-carboxamide derivatives as adenosine receptor agonists using structure-based ligand design and fragment screening. J Med Chem55:4297-308 (2012) 
 
Adenosine receptor A1
Name:Adenosine receptor A1
Type:Protein
Mol. Mass.:36704.13
Organism:Rattus norvegicus (rat)
Description:n/a
Residue:326
BDBM21220
NameBDBM21220
Synonyms:(2S,3S,4R,5R)-5-(6-amino-9H-purin-9-yl)-N-ethyl-3,4-dihydroxyoxolane-2-carboxamide Adenosine, N6-Ethyl-carboxamido CHEMBL464859 NECA
TypeAntineoplastic Agent
Emp. Form.C12H16N6O4
Mol. Mass.308.2932
SMILESCCNC(=O)[C@H]1O[C@H]([C@H](O)[C@@H]1O)n1cnc2c(N)ncnc12