Reaction Details
TargetAdenosine receptor A3
LigandBDBM50389796
Substrate/Competitorn/a
Meas. Tech.ChEMBL_834568 (CHEMBL2072276)
Ki 50±n/a nM
Citation Tosh, DKPhan, KGao, ZGGakh, AAXu, FDeflorian, FAbagyan, RStevens, RCJacobson, KAKatritch, V Optimization of adenosine 5'-carboxamide derivatives as adenosine receptor agonists using structure-based ligand design and fragment screening. J Med Chem55:4297-308 (2012) 
 
Adenosine receptor A3
Name:Adenosine receptor A3
Type:G Protein-Coupled Receptor (GPCR)
Mol. Mass.:36197.32
Organism:Homo sapiens (Human)
Description:P0DMS8
Residue:318
BDBM50389796
NameBDBM50389796
Synonyms:CHEMBL1235128
TypeSmall organic molecule
Emp. Form.C13H18N6O4
Mol. Mass.322.3198
SMILESCCCNC(=O)[C@H]1O[C@H]([C@H](O)[C@@H]1O)n1cnc2c(N)ncnc12