Reaction Details
TargetAdenosine receptor A2a
LigandBDBM50389797
Substrate/Competitorn/a
Meas. Tech.ChEMBL_834570 (CHEMBL2072278)
Ki 12±n/a nM
Citation Tosh, DKPhan, KGao, ZGGakh, AAXu, FDeflorian, FAbagyan, RStevens, RCJacobson, KAKatritch, V Optimization of adenosine 5'-carboxamide derivatives as adenosine receptor agonists using structure-based ligand design and fragment screening. J Med Chem55:4297-308 (2012) 
 
Adenosine receptor A2a
Name:Adenosine receptor A2a
Type:G Protein-Coupled Receptor (GPCR)
Mol. Mass.:45015.65
Organism:Rattus norvegicus (rat)
Description:Rat A2A receptors expressed in CHO cells.
Residue:410
BDBM50389797
NameBDBM50389797
Synonyms:CHEMBL261482
TypeSmall organic molecule
Emp. Form.C13H16N6O4
Mol. Mass.320.3039
SMILESNc1ncnc2n(cnc12)[C@@H]1O[C@@H]([C@@H](O)[C@H]1O)C(=O)NC1CC1