Reaction Details
TargetAdenosine receptor A2a
LigandBDBM50389798
Substrate/Competitorn/a
Meas. Tech.ChEMBL_834567 (CHEMBL2072275)
Ki 34±n/a nM
Citation Tosh, DKPhan, KGao, ZGGakh, AAXu, FDeflorian, FAbagyan, RStevens, RCJacobson, KAKatritch, V Optimization of adenosine 5'-carboxamide derivatives as adenosine receptor agonists using structure-based ligand design and fragment screening. J Med Chem55:4297-308 (2012) 
 
Adenosine receptor A2a
Name:Adenosine receptor A2a
Type:G Protein-Coupled Receptor (GPCR)
Mol. Mass.:44716.46
Organism:Homo sapiens (Human)
Description:P29274
Residue:412
BDBM50389798
NameBDBM50389798
Synonyms:CHEMBL2070507
TypeSmall organic molecule
Emp. Form.C14H18N6O4
Mol. Mass.334.3305
SMILESNc1ncnc2n(cnc12)[C@@H]1O[C@@H]([C@@H](O)[C@H]1O)C(=O)NC1CCC1