Reaction Details
TargetAdenosine receptor A2a
LigandBDBM50389829
Substrate/Competitorn/a
Meas. Tech.ChEMBL_834829 (CHEMBL2073146)
Ki 5012±n/a nM
Citation Sanders, MPRoumen, Lvan der Horst, ELane, JRVischer, HFvan Offenbeek, Jde Vries, HVerhoeven, SChow, KYVerkaar, FBeukers, MWMcGuire, RLeurs, RIjzerman, APde Vlieg, Jde Esch, IJZaman, GJKlomp, JPBender, Ade Graaf, C A prospective cross-screening study on G-protein-coupled receptors: lessons learned in virtual compound library design. J Med Chem55:5311-25 (2012) 
 
Adenosine receptor A2a
Name:Adenosine receptor A2a
Type:G Protein-Coupled Receptor (GPCR)
Mol. Mass.:44716.46
Organism:Homo sapiens (Human)
Description:P29274
Residue:412
BDBM50389829
NameBDBM50389829
Synonyms:CHEMBL2070833
TypeSmall organic molecule
Emp. Form.C22H23NO4
Mol. Mass.365.4223
SMILESOC(COc1ccc2C(=O)c3ccccc3C(=O)c2c1)CN1CCCCC1