Reaction Details
TargetAdenosine receptor A2a
LigandBDBM44650
Substrate/Competitorn/a
Meas. Tech.ChEMBL_834829 (CHEMBL2073146)
Ki 1000±n/a nM
Citation Sanders, MPRoumen, Lvan der Horst, ELane, JRVischer, HFvan Offenbeek, Jde Vries, HVerhoeven, SChow, KYVerkaar, FBeukers, MWMcGuire, RLeurs, RIjzerman, APde Vlieg, Jde Esch, IJZaman, GJKlomp, JPBender, Ade Graaf, C A prospective cross-screening study on G-protein-coupled receptors: lessons learned in virtual compound library design. J Med Chem55:5311-25 (2012) 
 
Adenosine receptor A2a
Name:Adenosine receptor A2a
Type:G Protein-Coupled Receptor (GPCR)
Mol. Mass.:44716.46
Organism:Homo sapiens (Human)
Description:P29274
Residue:412
BDBM44650
NameBDBM44650
Synonyms:1-({6-[(cyanomethyl)thio]benzimidazo[1,2-c]quinazolin-3-yl}carbonyl)piperidine-4-carboxamide 1-[6-(cyanomethylsulfanyl)benzimidazolo[1,2-c]quinazoline-3-carbonyl]piperidine-4-carboxamide 1-[[6-(cyanomethylthio)-3-benzimidazolo[1,2-c]quinazolinyl]-oxomethyl]-4-piperidinecarboxamide MLS000095230 cid_3240564
TypeSmall organic molecule
Emp. Form.C23H20N6O2S
Mol. Mass.444.509
SMILESNC(=O)C1CCN(CC1)C(=O)c1ccc2c3nc4ccccc4n3c(SCC#N)nc2c1