Reaction Details
TargetCannabinoid receptor 1
LigandBDBM50389926
Substrate/Competitorn/a
Meas. Tech.ChEMBL_834869 (CHEMBL2073229)
EC50>10000±n/a nM
Citation Piscitelli, FLigresti, ALa Regina, GColuccia, AMorera, LAllarà, MNovellino, EDi Marzo, VSilvestri, R Indole-2-carboxamides as allosteric modulators of the cannabinoid CB1 receptor. J Med Chem55:5627-31 (2012) 
 
Cannabinoid receptor 1
Name:Cannabinoid receptor 1
Type:G Protein-Coupled Receptor (GPCR)
Mol. Mass.:52868.96
Organism:Homo sapiens (Human)
Description:P21554
Residue:472
BDBM50389926
NameBDBM50389926
Synonyms:CHEMBL2071061
TypeSmall organic molecule
Emp. Form.C19H20ClN3O
Mol. Mass.341.835
SMILESCCc1c([nH]c2ccc(Cl)cc12)C(=O)NCCc1ccc(N)cc1