Reaction Details
TargetCannabinoid receptor 1
LigandBDBM50389930
Substrate/Competitorn/a
Meas. Tech.ChEMBL_834869 (CHEMBL2073229)
EC50 760±n/a nM
Citation Piscitelli, FLigresti, ALa Regina, GColuccia, AMorera, LAllarà, MNovellino, EDi Marzo, VSilvestri, R Indole-2-carboxamides as allosteric modulators of the cannabinoid CB1 receptor. J Med Chem55:5627-31 (2012) 
 
Cannabinoid receptor 1
Name:Cannabinoid receptor 1
Type:G Protein-Coupled Receptor (GPCR)
Mol. Mass.:52868.96
Organism:Homo sapiens (Human)
Description:P21554
Residue:472
BDBM50389930
NameBDBM50389930
Synonyms:CHEMBL2071065
TypeSmall organic molecule
Emp. Form.C19H18Cl2N2O
Mol. Mass.361.265
SMILESCCc1c([nH]c2ccc(Cl)cc12)C(=O)NCCc1ccc(Cl)cc1