Reaction Details
TargetCannabinoid receptor 1
LigandBDBM50389939
Substrate/Competitorn/a
Meas. Tech.ChEMBL_834869 (CHEMBL2073229)
EC50 140±n/a nM
Citation Piscitelli, FLigresti, ALa Regina, GColuccia, AMorera, LAllarà, MNovellino, EDi Marzo, VSilvestri, R Indole-2-carboxamides as allosteric modulators of the cannabinoid CB1 receptor. J Med Chem55:5627-31 (2012) 
 
Cannabinoid receptor 1
Name:Cannabinoid receptor 1
Type:G Protein-Coupled Receptor (GPCR)
Mol. Mass.:52868.96
Organism:Homo sapiens (Human)
Description:P21554
Residue:472
BDBM50389939
NameBDBM50389939
Synonyms:CHEMBL1553629
TypeSmall organic molecule
Emp. Form.C24H28ClN3O
Mol. Mass.409.952
SMILESCCc1c([nH]c2ccc(Cl)cc12)C(=O)NCCc1ccc(cc1)N1CCCCC1