Reaction Details
TargetCannabinoid receptor 1
LigandBDBM50389940
Substrate/Competitorn/a
Meas. Tech.ChEMBL_834870 (CHEMBL2073230)
IC50>10000±n/a nM
Citation Piscitelli, FLigresti, ALa Regina, GColuccia, AMorera, LAllarà, MNovellino, EDi Marzo, VSilvestri, R Indole-2-carboxamides as allosteric modulators of the cannabinoid CB1 receptor. J Med Chem55:5627-31 (2012) 
 
Cannabinoid receptor 1
Name:Cannabinoid receptor 1
Type:G Protein-Coupled Receptor (GPCR)
Mol. Mass.:52868.96
Organism:Homo sapiens (Human)
Description:P21554
Residue:472
BDBM50389940
NameBDBM50389940
Synonyms:CHEMBL2071055
TypeSmall organic molecule
Emp. Form.C24H27ClN2O2
Mol. Mass.410.936
SMILESCCc1c([nH]c2ccc(Cl)cc12)C(=O)OCCc1ccc(cc1)N1CCCCC1