Reaction Details
TargetCannabinoid receptor 2
LigandBDBM50389936
Substrate/Competitorn/a
Meas. Tech.ChEMBL_834876 (CHEMBL2073236)
IC50>10000±n/a nM
Citation Piscitelli, FLigresti, ALa Regina, GColuccia, AMorera, LAllarà, MNovellino, EDi Marzo, VSilvestri, R Indole-2-carboxamides as allosteric modulators of the cannabinoid CB1 receptor. J Med Chem55:5627-31 (2012) 
 
Cannabinoid receptor 2
Name:Cannabinoid receptor 2
Type:G Protein-Coupled Receptor (GPCR)
Mol. Mass.:39690.94
Organism:Homo sapiens (Human)
Description:P34972
Residue:360
BDBM50389936
NameBDBM50389936
Synonyms:CHEMBL2071072
TypeSmall organic molecule
Emp. Form.C17H14ClN3O3
Mol. Mass.343.764
SMILES[O-][N+](=O)c1ccc(CCNC(=O)c2cc3cc(Cl)ccc3[nH]2)cc1