Reaction Details
TargetCannabinoid receptor 2
LigandBDBM50389941
Substrate/Competitorn/a
Meas. Tech.ChEMBL_834876 (CHEMBL2073236)
IC50>10000±n/a nM
Citation Piscitelli, FLigresti, ALa Regina, GColuccia, AMorera, LAllarà, MNovellino, EDi Marzo, VSilvestri, R Indole-2-carboxamides as allosteric modulators of the cannabinoid CB1 receptor. J Med Chem55:5627-31 (2012) 
 
Cannabinoid receptor 2
Name:Cannabinoid receptor 2
Type:G Protein-Coupled Receptor (GPCR)
Mol. Mass.:39690.94
Organism:Homo sapiens (Human)
Description:P34972
Residue:360
BDBM50389941
NameBDBM50389941
Synonyms:CHEMBL2071056
TypeSmall organic molecule
Emp. Form.C19H17ClN2O4
Mol. Mass.372.802
SMILESCCc1c([nH]c2ccc(Cl)cc12)C(=O)OCCc1ccc(cc1)[N+]([O-])=O