Reaction Details
TargetCannabinoid receptor 2
LigandBDBM50389930
Substrate/Competitorn/a
Meas. Tech.ChEMBL_834876 (CHEMBL2073236)
IC50>10000±n/a nM
Citation Piscitelli, FLigresti, ALa Regina, GColuccia, AMorera, LAllarà, MNovellino, EDi Marzo, VSilvestri, R Indole-2-carboxamides as allosteric modulators of the cannabinoid CB1 receptor. J Med Chem55:5627-31 (2012) 
 
Cannabinoid receptor 2
Name:Cannabinoid receptor 2
Type:G Protein-Coupled Receptor (GPCR)
Mol. Mass.:39690.94
Organism:Homo sapiens (Human)
Description:P34972
Residue:360
BDBM50389930
NameBDBM50389930
Synonyms:CHEMBL2071065
TypeSmall organic molecule
Emp. Form.C19H18Cl2N2O
Mol. Mass.361.265
SMILESCCc1c([nH]c2ccc(Cl)cc12)C(=O)NCCc1ccc(Cl)cc1