Reaction Details
TargetAurora kinase B
LigandBDBM50389981
Substrate/Competitorn/a
Meas. Tech.ChEMBL_835007 (CHEMBL2073499)
IC50 16±n/a nM
Citation Curtin, MLHeyman, HRFrey, RRMarcotte, PAGlaser, KBJankowski, JRMagoc, TJAlbert, DHOlson, AMReuter, DRBouska, JJMontgomery, DAPalma, JPDonawho, CKStewart, KDTse, CMichaelides, MR Pyrazole diaminopyrimidines as dual inhibitors of KDR and Aurora B kinases. Bioorg Med Chem Lett22:4750-5 (2012) 
 
Aurora kinase B
Name:Aurora kinase B
Type:Protein
Mol. Mass.:39327.72
Organism:Homo sapiens (Human)
Description:Q96GD4
Residue:344
BDBM50389981
NameBDBM50389981
Synonyms:CHEMBL2071209
TypeSmall organic molecule
Emp. Form.C16H14F3N7O
Mol. Mass.377.3239
SMILESCn1cc(Nc2ncc(c(Nc3ccccc3C(N)=O)n2)C(F)(F)F)cn1