Reaction Details
TargetAurora kinase B
LigandBDBM50389986
Substrate/Competitorn/a
Meas. Tech.ChEMBL_835007 (CHEMBL2073499)
IC50 32±n/a nM
Citation Curtin, MLHeyman, HRFrey, RRMarcotte, PAGlaser, KBJankowski, JRMagoc, TJAlbert, DHOlson, AMReuter, DRBouska, JJMontgomery, DAPalma, JPDonawho, CKStewart, KDTse, CMichaelides, MR Pyrazole diaminopyrimidines as dual inhibitors of KDR and Aurora B kinases. Bioorg Med Chem Lett22:4750-5 (2012) 
 
Aurora kinase B
Name:Aurora kinase B
Type:Protein
Mol. Mass.:39327.72
Organism:Homo sapiens (Human)
Description:Q96GD4
Residue:344
BDBM50389986
NameBDBM50389986
Synonyms:CHEMBL2071214
TypeSmall organic molecule
Emp. Form.C14H18ClN7O
Mol. Mass.335.792
SMILESCn1cc(Nc2ncc(Cl)c(N[C@@H]3CCC[C@@H]3C(N)=O)n2)cn1