Reaction Details
TargetAurora kinase B
LigandBDBM50389985
Substrate/Competitorn/a
Meas. Tech.ChEMBL_835007 (CHEMBL2073499)
IC50 135±n/a nM
Citation Curtin, MLHeyman, HRFrey, RRMarcotte, PAGlaser, KBJankowski, JRMagoc, TJAlbert, DHOlson, AMReuter, DRBouska, JJMontgomery, DAPalma, JPDonawho, CKStewart, KDTse, CMichaelides, MR Pyrazole diaminopyrimidines as dual inhibitors of KDR and Aurora B kinases. Bioorg Med Chem Lett22:4750-5 (2012) 
 
Aurora kinase B
Name:Aurora kinase B
Type:Protein
Mol. Mass.:39327.72
Organism:Homo sapiens (Human)
Description:Q96GD4
Residue:344
BDBM50389985
NameBDBM50389985
Synonyms:CHEMBL2071213
TypeSmall organic molecule
Emp. Form.C15H20ClN7O
Mol. Mass.349.819
SMILESCn1cc(Nc2ncc(Cl)c(N[C@@H]3CCCC[C@@H]3C(N)=O)n2)cn1