Reaction Details
TargetVascular endothelial growth factor receptor 2
LigandBDBM50389991
Substrate/Competitorn/a
Meas. Tech.ChEMBL_835008 (CHEMBL2073500)
IC50>316±n/a nM
Citation Curtin, MLHeyman, HRFrey, RRMarcotte, PAGlaser, KBJankowski, JRMagoc, TJAlbert, DHOlson, AMReuter, DRBouska, JJMontgomery, DAPalma, JPDonawho, CKStewart, KDTse, CMichaelides, MR Pyrazole diaminopyrimidines as dual inhibitors of KDR and Aurora B kinases. Bioorg Med Chem Lett22:4750-5 (2012) 
 
Vascular endothelial growth factor receptor 2
Name:Vascular endothelial growth factor receptor 2
Type:Receptor Tyrosine Kinase
Mol. Mass.:151510.97
Organism:Homo sapiens (Human)
Description:P35968
Residue:1356
BDBM50389991
NameBDBM50389991
Synonyms:CHEMBL2071271
TypeSmall organic molecule
Emp. Form.C17H18ClN7O3
Mol. Mass.403.823
SMILESNC(=O)[C@H]1[C@H]2C[C@H](C=C2)[C@H]1Nc1nc(Nc2cnn(CC(O)=O)c2)ncc1Cl