Reaction Details
TargetVascular endothelial growth factor receptor 2
LigandBDBM50389969
Substrate/Competitorn/a
Meas. Tech.ChEMBL_835006 (CHEMBL2073498)
IC50>12000±n/a nM
Citation Curtin, MLHeyman, HRFrey, RRMarcotte, PAGlaser, KBJankowski, JRMagoc, TJAlbert, DHOlson, AMReuter, DRBouska, JJMontgomery, DAPalma, JPDonawho, CKStewart, KDTse, CMichaelides, MR Pyrazole diaminopyrimidines as dual inhibitors of KDR and Aurora B kinases. Bioorg Med Chem Lett22:4750-5 (2012) 
 
Vascular endothelial growth factor receptor 2
Name:Vascular endothelial growth factor receptor 2
Type:Receptor Tyrosine Kinase
Mol. Mass.:151510.97
Organism:Homo sapiens (Human)
Description:P35968
Residue:1356
BDBM50389969
NameBDBM50389969
Synonyms:CHEMBL2071195
TypeSmall organic molecule
Emp. Form.C16H19N7O
Mol. Mass.325.3684
SMILESCn1cc(Nc2nccc(N[C@@H]3[C@@H]4C[C@@H](C=C4)[C@@H]3C(N)=O)n2)cn1