Reaction Details
TargetReceptor-type tyrosine-protein kinase FLT3
LigandBDBM50389975
Substrate/Competitorn/a
Meas. Tech.ChEMBL_835018 (CHEMBL2073510)
IC50 1±n/a nM
Citation Curtin, MLHeyman, HRFrey, RRMarcotte, PAGlaser, KBJankowski, JRMagoc, TJAlbert, DHOlson, AMReuter, DRBouska, JJMontgomery, DAPalma, JPDonawho, CKStewart, KDTse, CMichaelides, MR Pyrazole diaminopyrimidines as dual inhibitors of KDR and Aurora B kinases. Bioorg Med Chem Lett22:4750-5 (2012) 
 
Receptor-type tyrosine-protein kinase FLT3
Name:Receptor-type tyrosine-protein kinase FLT3
Type:Enzyme
Mol. Mass.:112888.62
Organism:Homo sapiens (Human)
Description:P36888
Residue:993
BDBM50389975
NameBDBM50389975
Synonyms:CHEMBL2071201
TypeSmall organic molecule
Emp. Form.C16H18BrN7O
Mol. Mass.404.264
SMILESCn1cc(Nc2ncc(Br)c(N[C@@H]3[C@@H]4C[C@@H](C=C4)[C@@H]3C(N)=O)n2)cn1