Reaction Details
TargetAcetylcholinesterase
LigandBDBM50342601
Substrate/Competitorn/a
Meas. Tech.ChEMBL_833863 (CHEMBL2072352)
IC50 12±n/a nM
Citation Ohlendorf, BSchulz, DErhard, ANagel, KImhoff, JF Geranylphenazinediol, an acetylcholinesterase inhibitor produced by a Streptomyces species. J Nat Prod75:1400-4 (2012) 
 
Acetylcholinesterase
Name:Acetylcholinesterase
Type:Enzyme
Mol. Mass.:67792.70
Organism:Homo sapiens (Human)
Description:P22303
Residue:614
BDBM50342601
NameBDBM50342601
Synonyms:CHEMBL1255901 | Huperzine A
TypeSmall organic molecule
Emp. Form.C15H18N2O
Mol. Mass.242.3162
SMILESC\C=C1/[C@@H]2Cc3[nH]c(=O)ccc3[C@]1(N)CC(C)=C2