Reaction Details
TargetSodium channel protein type 9 subunit alpha
LigandBDBM50390077
Substrate/Competitorn/a
Meas. Tech.ChEMBL_834010 (CHEMBL2072750)
IC50 158.49±n/a nM
Citation Kers, ICsjernyik, GMacsari, INylöf, MSandberg, LSkogholm, KBueters, TEriksson, ABOerther, SLund, PEVenyike, ENyström, JEBesidski, Y Structure and activity relationship in the (S)-N-chroman-3-ylcarboxamide series of voltage-gated sodium channel blockers. Bioorg Med Chem Lett22:5618-24 (2012) 
 
Sodium channel protein type 9 subunit alpha
Name:Sodium channel protein type 9 subunit alpha
Type:Protein
Mol. Mass.:226375.97
Organism:Homo sapiens (Human)
Description:Q15858
Residue:1988
BDBM50390077
NameBDBM50390077
Synonyms:CHEMBL2069404
TypeSmall organic molecule
Emp. Form.C26H32N6O2
Mol. Mass.460.5713
SMILESCN1CCN(CC1)c1cccc2OC[C@H](Cc12)NC(=O)c1nn(nc1C)-c1ccc(C)cc1C