Reaction Details
TargetSodium channel protein type 9 subunit alpha
LigandBDBM50390089
Substrate/Competitorn/a
Meas. Tech.ChEMBL_834010 (CHEMBL2072750)
IC50 79.43±n/a nM
Citation Kers, ICsjernyik, GMacsari, INylöf, MSandberg, LSkogholm, KBueters, TEriksson, ABOerther, SLund, PEVenyike, ENyström, JEBesidski, Y Structure and activity relationship in the (S)-N-chroman-3-ylcarboxamide series of voltage-gated sodium channel blockers. Bioorg Med Chem Lett22:5618-24 (2012) 
 
Sodium channel protein type 9 subunit alpha
Name:Sodium channel protein type 9 subunit alpha
Type:Protein
Mol. Mass.:226375.97
Organism:Homo sapiens (Human)
Description:Q15858
Residue:1988
BDBM50390089
NameBDBM50390089
Synonyms:CHEMBL2069421
TypeSmall organic molecule
Emp. Form.C22H19F3N4O4
Mol. Mass.460.4059
SMILESCOc1ncc(cn1)-c1cccc2OC[C@H](Cc12)NC(=O)c1ccc(OCC(F)(F)F)nc1