Reaction Details
TargetPotassium voltage-gated channel subfamily H member 2
LigandBDBM50390075
Substrate/Competitorn/a
Meas. Tech.ChEMBL_834012 (CHEMBL2072752)
IC50 12589.25±n/a nM
Citation Kers, ICsjernyik, GMacsari, INylöf, MSandberg, LSkogholm, KBueters, TEriksson, ABOerther, SLund, PEVenyike, ENyström, JEBesidski, Y Structure and activity relationship in the (S)-N-chroman-3-ylcarboxamide series of voltage-gated sodium channel blockers. Bioorg Med Chem Lett22:5618-24 (2012) 
 
Potassium voltage-gated channel subfamily H member 2
Name:Potassium voltage-gated channel subfamily H member 2
Type:Multi-pass membrane protein
Mol. Mass.:126672.65
Organism:Homo sapiens (Human)
Description:Q12809
Residue:1159
BDBM50390075
NameBDBM50390075
Synonyms:CHEMBL2069402
TypeSmall organic molecule
Emp. Form.C23H27F3N4O3
Mol. Mass.464.4807
SMILESCN1CCN(CC1)c1cccc2OC[C@H](Cc12)NC(=O)c1ccc(OCCC(F)(F)F)nc1