Reaction Details
TargetPotassium voltage-gated channel subfamily H member 2
LigandBDBM50390071
Substrate/Competitorn/a
Meas. Tech.ChEMBL_834012 (CHEMBL2072752)
IC50 10000±n/a nM
Citation Kers, ICsjernyik, GMacsari, INylöf, MSandberg, LSkogholm, KBueters, TEriksson, ABOerther, SLund, PEVenyike, ENyström, JEBesidski, Y Structure and activity relationship in the (S)-N-chroman-3-ylcarboxamide series of voltage-gated sodium channel blockers. Bioorg Med Chem Lett22:5618-24 (2012) 
 
Potassium voltage-gated channel subfamily H member 2
Name:Potassium voltage-gated channel subfamily H member 2
Type:Multi-pass membrane protein
Mol. Mass.:126672.65
Organism:Homo sapiens (Human)
Description:Q12809
Residue:1159
BDBM50390071
NameBDBM50390071
Synonyms:CHEMBL2069411
TypeSmall organic molecule
Emp. Form.C23H20F3N3O4
Mol. Mass.459.4178
SMILESOCc1ccc(cn1)-c1cccc2OC[C@H](Cc12)NC(=O)c1ccc(OCC(F)(F)F)nc1