Reaction Details
TargetSigma non-opioid intracellular receptor 1
LigandBDBM50324086
Substrate/Competitorn/a
Meas. Tech.ChEMBL_834660 (CHEMBL2072546)
Ki 1.61±n/a nM
Citation Moussa, IABanister, SDManoli, MDoddareddy, MRCui, JMach, RHKassiou, M Exploration of ring size in a series of cyclic vicinal diamines withs1 receptor affinity. Bioorg Med Chem Lett22:5493-7 (2012) 
 
Sigma non-opioid intracellular receptor 1
Name:Sigma non-opioid intracellular receptor 1
Type:Protein
Mol. Mass.:25307.17
Organism:Cavia porcellus (Guinea pig)
Description:Q60492
Residue:223
BDBM50324086
NameBDBM50324086
Synonyms:CHEMBL1214893 | N-(Benzofuran-2-ylmethyl)-N'-(4'-(3''-fluoropropoxy)benzyl)-piperazine
TypeSmall organic molecule
Emp. Form.C23H27FN2O2
Mol. Mass.382.4711
SMILESFCCCOc1ccc(CN2CCN(Cc3cc4ccccc4o3)CC2)cc1