Reaction Details
TargetTyrosine-protein kinase ABL1
LigandBDBM50343431
Substrate/Competitorn/a
Meas. Tech.ChEMBL_834782 (CHEMBL2073050)
Ki 150±n/a nM
Citation Radi, MEvensen, LDreassi, EZamperini, CCaporicci, MFalchi, FMusumeci, FSchenone, SLorens, JBBotta, M A combined targeted/phenotypic approach for the identification of new antiangiogenics agents active on a zebrafish model: from in silico screening to cyclodextrin formulation. Bioorg Med Chem Lett22:5579-83 (2012) 
 
Tyrosine-protein kinase ABL1
Name:Tyrosine-protein kinase ABL1
Type:Enzyme
Mol. Mass.:122897.30
Organism:Homo sapiens (Human)
Description:P00519
Residue:1130
BDBM50343431
NameBDBM50343431
Synonyms:1-(2-Chloro-2-phenylethyl)-6-[(2-morpholin-4-ylethyl)thio]-Nphenyl-1H-pyrazolo[3,4-d]pyrimidin-4-amine | CHEMBL1775035
TypeSmall organic molecule
Emp. Form.C25H27ClN6OS
Mol. Mass.495.039
SMILESClC(Cn1ncc2c(Nc3ccccc3)nc(SCCN3CCOCC3)nc12)c1ccccc1