Reaction Details
TargetS-methyl-5'-thioadenosine phosphorylase
LigandBDBM50390240
Substrate/Competitorn/a
Meas. Tech.ChEMBL_834947 (CHEMBL2073357)
Ki 1±n/a nM
Citation Clinch, KEvans, GBFröhlich, RFGulab, SAGutierrez, JAMason, JMSchramm, VLTyler, PCWoolhouse, AD Transition state analogue inhibitors of human methylthioadenosine phosphorylase and bacterial methylthioadenosine/S-adenosylhomocysteine nucleosidase incorporating acyclic ribooxacarbenium ion mimics. Bioorg Med Chem20:5181-7 (2012) 
 
S-methyl-5'-thioadenosine phosphorylase
Name:S-methyl-5'-thioadenosine phosphorylase
Type:Enzyme
Mol. Mass.:31239.23
Organism:Homo sapiens (Human)
Description:n/a
Residue:283
BDBM50390240
NameBDBM50390240
Synonyms:CHEMBL1195586
TypeSmall organic molecule
Emp. Form.C12H17N5O2S
Mol. Mass.295.361
SMILESCSC[C@H]1N[C@H]([C@H](O)[C@@H]1O)c1c[nH]c2c(N)ncnc12