Reaction Details
TargetHigh affinity cAMP-specific and IBMX-insensitive 3',5'-cyclic phosphodiesterase 8B
LigandBDBM50390313
Substrate/Competitorn/a
Meas. Tech.ChEMBL_835072 (CHEMBL2073616)
IC50 10±n/a nM
Citation DeNinno, MPWright, SWEtienne, JBOlson, TVRocke, BNCorbett, JWKung, DWDiRico, KJAndrews, KMMillham, MLParker, JCEsler, Wvan Volkenburg, MBoyer, DDHouseknecht, KLDoran, SD Discovery of triazolopyrimidine-based PDE8B inhibitors: exceptionally ligand-efficient and lipophilic ligand-efficient compounds for the treatment of diabetes. Bioorg Med Chem Lett22:5721-6 (2012) 
 
High affinity cAMP-specific and IBMX-insensitive 3',5'-cyclic phosphodiesterase 8B
Name:High affinity cAMP-specific and IBMX-insensitive 3',5'-cyclic phosphodiesterase 8B
Type:PROTEIN
Mol. Mass.:98984.88
Organism:Homo sapiens (Human)
Description:ChEMBL_876321
Residue:885
BDBM50390313
NameBDBM50390313
Synonyms:CHEMBL2070595
TypeSmall organic molecule
Emp. Form.C13H18N6O
Mol. Mass.274.3216
SMILESNc1nc(nc2n(CC3CCCCO3)nnc12)C1CC1