Reaction Details
TargetHigh affinity cAMP-specific and IBMX-insensitive 3',5'-cyclic phosphodiesterase 8B
LigandBDBM50390335
Substrate/Competitorn/a
Meas. Tech.ChEMBL_835072 (CHEMBL2073616)
IC50 4.2±n/a nM
Citation DeNinno, MPWright, SWEtienne, JBOlson, TVRocke, BNCorbett, JWKung, DWDiRico, KJAndrews, KMMillham, MLParker, JCEsler, Wvan Volkenburg, MBoyer, DDHouseknecht, KLDoran, SD Discovery of triazolopyrimidine-based PDE8B inhibitors: exceptionally ligand-efficient and lipophilic ligand-efficient compounds for the treatment of diabetes. Bioorg Med Chem Lett22:5721-6 (2012) 
 
High affinity cAMP-specific and IBMX-insensitive 3',5'-cyclic phosphodiesterase 8B
Name:High affinity cAMP-specific and IBMX-insensitive 3',5'-cyclic phosphodiesterase 8B
Type:PROTEIN
Mol. Mass.:98984.88
Organism:Homo sapiens (Human)
Description:ChEMBL_876321
Residue:885
BDBM50390335
NameBDBM50390335
Synonyms:CHEMBL2070736
TypeSmall organic molecule
Emp. Form.C16H22N8OS
Mol. Mass.374.464
SMILESCCc1csc(CN2CCO[C@@H](Cn3nnc4c(N)nc(C)nc34)C2)n1