Reaction Details
TargetCathepsin K
LigandBDBM50390405
Substrate/Competitorn/a
Meas. Tech.ChEMBL_834955 (CHEMBL2073365)
IC50 15.85±n/a nM
Citation Dossetter, AGBowyer, JCook, CRCrawford, JJFinlayson, JEHeron, NMHeyes, CHighton, AJHudson, JAJestel, AKrapp, SMacFaul, PAMcGuire, TMMorley, ADMorris, JJPage, KMRibeiro, LRSawney, HSteinbacher, SSmith, C Isosteric replacements for benzothiazoles and optimisation to potent Cathepsin K inhibitors free from hERG channel inhibition. Bioorg Med Chem Lett22:5563-8 (2012) 
 
Cathepsin K
Name:Cathepsin K
Type:Enzyme
Mol. Mass.:36975.68
Organism:Homo sapiens (Human)
Description:P43235
Residue:329
BDBM50390405
NameBDBM50390405
Synonyms:CHEMBL2070951
TypeSmall organic molecule
Emp. Form.C22H26N6O2S
Mol. Mass.438.546
SMILESO=C(NC1(CC1)C#N)[C@@H]1CCCC[C@H]1C(=O)N1CCN(CC1)c1nc2cnccc2s1