Reaction Details
TargetPhosphatidylinositol 4-kinase beta
LigandBDBM50390409
Substrate/Competitorn/a
Meas. Tech.ChEMBL_834242 (CHEMBL2073009)
IC50 40±n/a nM
Citation Bruce, IAkhlaq, MBloomfield, GCBudd, ECox, BCuenoud, BFinan, PGedeck, PHatto, JHayler, JFHead, DKeller, TKirman, LLeblanc, CLe Grand, DMcCarthy, CO'Connor, DOwen, COza, MSPilgrim, GPress, NESviridenko, LWhitehead, L Development of isoform selective PI3-kinase inhibitors as pharmacological tools for elucidating the PI3K pathway. Bioorg Med Chem Lett22:5445-50 (2012) 
 
Phosphatidylinositol 4-kinase beta
Name:Phosphatidylinositol 4-kinase beta
Type:Protein
Mol. Mass.:91373.30
Organism:Homo sapiens (Human)
Description:n/a
Residue:816
BDBM50390409
NameBDBM50390409
Synonyms:CHEMBL1986603
TypeSmall organic molecule
Emp. Form.C21H21N7O3S
Mol. Mass.451.502
SMILESCc1cc(NC(=O)CCNC(=O)Nc2nc(C)c(s2)-c2ccc(cc2)-n2cccn2)no1