Reaction Details
TargetPhosphatidylinositol 4,5-bisphosphate 3-kinase catalytic subunit gamma isoform
LigandBDBM50390411
Substrate/Competitorn/a
Meas. Tech.ChEMBL_834229 (CHEMBL2072996)
Ki 36±n/a nM
Citation Bruce, IAkhlaq, MBloomfield, GCBudd, ECox, BCuenoud, BFinan, PGedeck, PHatto, JHayler, JFHead, DKeller, TKirman, LLeblanc, CLe Grand, DMcCarthy, CO'Connor, DOwen, COza, MSPilgrim, GPress, NESviridenko, LWhitehead, L Development of isoform selective PI3-kinase inhibitors as pharmacological tools for elucidating the PI3K pathway. Bioorg Med Chem Lett22:5445-50 (2012) 
 
Phosphatidylinositol 4,5-bisphosphate 3-kinase catalytic subunit gamma isoform
Name:Phosphatidylinositol 4,5-bisphosphate 3-kinase catalytic subunit gamma isoform
Type:Enzyme Subunit
Mol. Mass.:126470.30
Organism:Homo sapiens (Human)
Description:P48736
Residue:1102
BDBM50390411
NameBDBM50390411
Synonyms:CHEMBL2071342
TypeSmall organic molecule
Emp. Form.C17H20FN7O3S2
Mol. Mass.453.514
SMILESCCn1nnc(CCNC(=O)Nc2nc(C)c(s2)-c2ccc(c(F)c2)S(C)(=O)=O)n1