Reaction Details
TargetPhosphatidylinositol 4,5-bisphosphate 3-kinase catalytic subunit alpha isoform
LigandBDBM50390418
Substrate/Competitorn/a
Meas. Tech.ChEMBL_834262 (CHEMBL2073029)
Ki 28±n/a nM
Citation Bruce, IAkhlaq, MBloomfield, GCBudd, ECox, BCuenoud, BFinan, PGedeck, PHatto, JHayler, JFHead, DKeller, TKirman, LLeblanc, CLe Grand, DMcCarthy, CO'Connor, DOwen, COza, MSPilgrim, GPress, NESviridenko, LWhitehead, L Development of isoform selective PI3-kinase inhibitors as pharmacological tools for elucidating the PI3K pathway. Bioorg Med Chem Lett22:5445-50 (2012) 
 
Phosphatidylinositol 4,5-bisphosphate 3-kinase catalytic subunit alpha isoform
Name:Phosphatidylinositol 4,5-bisphosphate 3-kinase catalytic subunit alpha isoform
Type:Enzyme Subunit
Mol. Mass.:124294.87
Organism:Homo sapiens (Human)
Description:P42336
Residue:1068
BDBM50390418
NameBDBM50390418
Synonyms:CHEMBL2071332
TypeSmall organic molecule
Emp. Form.C14H13F3N2O3S2
Mol. Mass.378.39
SMILESCC(=O)Nc1nc(C)c(s1)-c1ccc(c(c1)C(F)(F)F)S(C)(=O)=O