Reaction Details
TargetPhosphatidylinositol 4,5-bisphosphate 3-kinase catalytic subunit alpha isoform
LigandBDBM50390424
Substrate/Competitorn/a
Meas. Tech.ChEMBL_834262 (CHEMBL2073029)
Ki 110±n/a nM
Citation Bruce, IAkhlaq, MBloomfield, GCBudd, ECox, BCuenoud, BFinan, PGedeck, PHatto, JHayler, JFHead, DKeller, TKirman, LLeblanc, CLe Grand, DMcCarthy, CO'Connor, DOwen, COza, MSPilgrim, GPress, NESviridenko, LWhitehead, L Development of isoform selective PI3-kinase inhibitors as pharmacological tools for elucidating the PI3K pathway. Bioorg Med Chem Lett22:5445-50 (2012) 
 
Phosphatidylinositol 4,5-bisphosphate 3-kinase catalytic subunit alpha isoform
Name:Phosphatidylinositol 4,5-bisphosphate 3-kinase catalytic subunit alpha isoform
Type:Enzyme Subunit
Mol. Mass.:124294.87
Organism:Homo sapiens (Human)
Description:P42336
Residue:1068
BDBM50390424
NameBDBM50390424
Synonyms:CHEMBL2071340
TypeSmall organic molecule
Emp. Form.C19H20FN5O5S2
Mol. Mass.481.521
SMILESCc1cc(NC(=O)CCNC(=O)Nc2nc(C)c(s2)-c2ccc(c(F)c2)S(C)(=O)=O)no1