Reaction Details
TargetCasein kinase I isoform alpha
LigandBDBM124350
Substrate/Competitorn/a
Meas. Tech.ChEMBL_835301 (CHEMBL2072007)
IC50 12100±n/a nM
Citation Hua, ZHuang, XBregman, HChakka, NDiMauro, EFDoherty, EMGoldstein, JGunaydin, HHuang, HMercede, SNewcomb, JPatel, VFTurci, SMYan, JWilson, CMartin, MW 2-Phenylamino-6-cyano-1H-benzimidazole-based isoform selective casein kinase 1 gamma (CK1¿) inhibitors. Bioorg Med Chem Lett22:5392-5 (2012) 
 
Casein kinase I isoform alpha
Name:Casein kinase I isoform alpha
Type:Serine/threonine-protein kinase
Mol. Mass.:38936.59
Organism:Homo sapiens (Human)
Description:P48729
Residue:337
BDBM124350
NameBDBM124350
Synonyms:CHEMBL2071607 | US8759532, 1
TypeSmall organic molecule
Emp. Form.C20H12F3N5O
Mol. Mass.395.3374
SMILESFC(F)(F)c1cccnc1Oc1ccc(Nc2nc3ccc(cc3[nH]2)C#N)cc1