Reaction Details
TargetCasein kinase I isoform alpha
LigandBDBM50390499
Substrate/Competitorn/a
Meas. Tech.ChEMBL_835301 (CHEMBL2072007)
IC50 19700±n/a nM
Citation Hua, ZHuang, XBregman, HChakka, NDiMauro, EFDoherty, EMGoldstein, JGunaydin, HHuang, HMercede, SNewcomb, JPatel, VFTurci, SMYan, JWilson, CMartin, MW 2-Phenylamino-6-cyano-1H-benzimidazole-based isoform selective casein kinase 1 gamma (CK1¿) inhibitors. Bioorg Med Chem Lett22:5392-5 (2012) 
 
Casein kinase I isoform alpha
Name:Casein kinase I isoform alpha
Type:Serine/threonine-protein kinase
Mol. Mass.:38936.59
Organism:Homo sapiens (Human)
Description:P48729
Residue:337
BDBM50390499
NameBDBM50390499
Synonyms:CHEMBL2071613
TypeSmall organic molecule
Emp. Form.C15H12N4
Mol. Mass.248.2826
SMILESCc1ccc(Nc2nc3ccc(cc3[nH]2)C#N)cc1